{"text_format":"1","workbook":"xlsx","n_sheets":7,"sheets":["FY21 Q1","New FY23","Printer Friendly","Descriptions","FY21 Q2","FY21 Q3","FY21 Q4"],"not_rendered":{"charts":0,"images":5,"macros":1,"external_links":0,"defined_names":0,"comments":6,"pivot_tables":0},"unopened":[],"bounds":{"document_bytes":16777216,"sheet_cells":100000,"rows_first":2000,"rows_last":500,"rows_between":2000,"halvings":0,"cell_chars":16384,"cell_head_chars":4096},"cells_cut":0,"cells_raw":0,"read":"whole","date_system":"1900"}

{"sheet":"FY21 Q1","index":0,"n_rows":29,"n_cols":22,"rows_kept":29,"cut":false,"hidden":true,"merged":[[0,0,0,21],[1,5,1,7],[1,8,1,11]]}
["Assume each class will be posted on Social Media, have one e-blast, be placed on our online calendar and the quarterly Printable List on our website. If you want an extra e-blast, to pay for advertisement (need permission), a PSA or others, please put that in \"notes\""]
["Drop-down List","Input first","Auto- fill","Drop-down","Auto- fill","Auto- fill",null,null,"Input",null,null,null,"Drop-down List","Click on what you need","Input","Drop-down List","Input","Drop-down List","Input","Auto- fill","Click","Click"]
["Subject","******* Event Start Date","Event Start Day","Prof. or reg. Event","Promo Request  Due to Marc","Flyer Draft Due from Marc","First changes back to Marc by","Flyer Sent and posted to calendars by","Event Start Time","Event End Time","Event End Date","Second date/ times of class","Location","Reg, RSVP, Fee, Contact Hours","Zoom/Social Media Link/Teleconference #","Who","Additional Presenter","Calendar Name","Notes","Description","Director Flyer Final Sign off","Director e-mail Final Sign Off"]
[null,null,{"$f":"WEEKDAY(B4)","v":"1900-01-07"},null,{"$f":"F4-21","v":{"$error":"#VALUE!"}},{"$f":"WORKDAY(G4,-2)","v":{"$error":"#VALUE!"}},{"$f":"WORKDAY(H4,-4)","v":{"$error":"#VALUE!"}},{"$f":"IF(D4=\"Prof\",B4-42,IF(D4=\"reg\",B4-21,\"\"))","v":""},null,null,null,null,null,"Must Register\nMust RSVP\nFee\n    Contact Hrs.",null,null,null,null,null,{"$f":"VLOOKUP(A4,Descriptions!A2:B152,2)","v":{"$error":"#N/A"}},"     Francy\n     Kay","     Francy\n     Kay"]
[null,null,{"$f":"WEEKDAY(B5)","v":"1900-01-07"},null,{"$error":"#VALUE!"},{"$error":"#VALUE!"},{"$f":"WORKDAY.INTL(H5,-4)","v":{"$error":"#VALUE!"}},{"$f":"IF(D5=\"Prof\",B5-42,IF(D5=\"reg\",B5-21,\"\"))","v":""},null,null,null,null,null,"Must Register\nMust RSVP\nFee\n    Contact Hrs.",null,null,null,null,null,{"$f":"VLOOKUP(A5,Descriptions!A4:B154,2)","v":{"$error":"#N/A"}},"     Francy\n     Kay","     Francy\n     Kay"]
[null,null,"1900-01-07",null,{"$error":"#VALUE!"},{"$error":"#VALUE!"},{"$f":"WORKDAY.INTL(H6,-4)","v":{"$error":"#VALUE!"}},{"$f":"IF(D6=\"Prof\",B6-42,IF(D6=\"reg\",B6-21,\"\"))","v":""},null,null,null,null,null,"Must Register\nMust RSVP\nFee\n    Contact Hrs.",null,null,null,null,null,{"$f":"VLOOKUP(A6,Descriptions!A6:B155,2)","v":{"$error":"#N/A"}},"     Francy\n     Kay","     Francy\n     Kay"]
[null,null,"1900-01-07",null,{"$error":"#VALUE!"},{"$error":"#VALUE!"},{"$f":"WORKDAY.INTL(H7,-4)","v":{"$error":"#VALUE!"}},{"$f":"IF(D7=\"Prof\",B7-42,IF(D7=\"reg\",B7-21,\"\"))","v":""},null,null,null,null,null,"Must Register\nMust RSVP\nFee\n    Contact Hrs.",null,null,null,null,null,{"$f":"VLOOKUP(A7,Descriptions!A8:B156,2)","v":{"$error":"#N/A"}},"     Francy\n     Kay","     Francy\n     Kay"]
[null,null,"1900-01-07",null,{"$error":"#VALUE!"},{"$error":"#VALUE!"},{"$f":"WORKDAY.INTL(H8,-4)","v":{"$error":"#VALUE!"}},{"$f":"IF(D8=\"Prof\",B8-42,IF(D8=\"reg\",B8-21,\"\"))","v":""},null,null,null,null,null,"Must Register\nMust RSVP\nFee\n    Contact Hrs.",null,null,null,null,null,{"$f":"VLOOKUP(A8,Descriptions!A9:B157,2)","v":{"$error":"#N/A"}},"     Francy\n     Kay","     Francy\n     Kay"]
{"$rows_left_out":22}
{"sheet":"New FY23","index":1,"n_rows":20,"n_cols":24,"rows_kept":20,"cut":false,"hidden":false,"merged":[[1,5,1,8]]}
["Subject","*** Event Start Date ***","Event Start Day","Prof. or reg. Event","Promo Request  Due ","Event Start Time","Event End Time","Event End Date","Second date/ times of class","Location","Registration Required","RSVP Required","Fee","Contact Hours (CEU)","No Promo needed","Zoom/Social Media Link/Teleconference #","Who - Class Instructor","Additional Presenter – \nAdd to Promo material","Notes","Description"]
["Drop-down List","Input first","Auto- fill","Drop-down","Auto- fill","Input",null,null,null,"Drop-down List","x ","x","x","#","x","Input","Drop-down List","Input","Input","Auto- fill"]
["EXAMPLE",{"$f":"TODAY()+120","v":"2023-07-25"},{"$f":"WEEKDAY(B3)","v":"1900-01-03"},"Prof",{"$f":"INDEX($W$4:$W$18,MIN(IF((DATEVALUE(RIGHT(X4:X18,LEN(X4:X18)-FIND(\"/\",X4:X18)))>=B3)*(DATEVALUE(LEFT(X4:X18,FIND(\"/\",X4:X18)-1))<=B3),MATCH(ROW($W$4:$W$18),ROW($W$4:$W$18)),\"\")))","v":"2023-04-15"},"12:00:00","13:00:00",null,null,"Statewide – Zoom","x ",null,"x",1,null,"Zoom link goes here","Amber Smith",null,null,"alzalaska.org/class-descriptions",null,null,"Due Date","Date Range"]
[null,null,"1900-01-07",null,{"$f":"INDEX($W$4:$W$18,MIN(IF((DATEVALUE(RIGHT(X4:X18,LEN(X4:X18)-FIND(\"/\",X4:X18)))>=B4)*(DATEVALUE(LEFT(X4:X18,FIND(\"/\",X4:X18)-1))<=B4),MATCH(ROW($W$4:$W$18),ROW($W$4:$W$18)),\"\")))","v":"2021-04-15"},null,null,null,null,null,null,null,null,null,null,null,null,null,null,{"$f":"VLOOKUP(A4,Descriptions!A1:B160,2)","v":{"$error":"#N/A"}},null,null,"2021-04-15","2021-07-01/2021-09-30"]
[null,null,{"$f":"WEEKDAY(B5)","v":"1900-01-07"},null,{"$f":"INDEX($W$4:$W$18,MIN(IF((DATEVALUE(RIGHT(X4:X18,LEN(X4:X18)-FIND(\"/\",X4:X18)))>=B5)*(DATEVALUE(LEFT(X4:X18,FIND(\"/\",X4:X18)-1))<=B5),MATCH(ROW($W$4:$W$18),ROW($W$4:$W$18)),\"\")))","v":"2021-04-15"},null,null,null,null,null,null,null,null,null,null,null,null,null,null,{"$f":"VLOOKUP(A5,Descriptions!A1:B160,2)","v":{"$error":"#N/A"}},null,null,"2021-07-15","2021-10-01/2021-12-31"]
[null,null,"1900-01-07",null,null,null,null,null,null,null,null,null,null,null,null,null,null,null,null,{"$f":"VLOOKUP(A6,Descriptions!#REF!,2)","v":{"$error":"#REF!"}},null,null,"2021-10-15","2022-01-01/2022-03-31"]
[null,null,"1900-01-07",null,{"$f":"INDEX($W$4:$W$18,MIN(IF((DATEVALUE(RIGHT(X4:X18,LEN(X4:X18)-FIND(\"/\",X4:X18)))>=B7)*(DATEVALUE(LEFT(X4:X18,FIND(\"/\",X4:X18)-1))<=B7),MATCH(ROW($W$4:$W$18),ROW($W$4:$W$18)),\"\")))","v":"2021-04-15"},null,null,null,null,null,null,null,null,null,null,null,null,null,null,{"$f":"VLOOKUP(A7,Descriptions!A1:B160,2)","v":{"$error":"#N/A"}},null,null,"2022-01-15","2022-04-01/2022-06-30"]
[null,null,"1900-01-07",null,{"$f":"INDEX($W$4:$W$18,MIN(IF((DATEVALUE(RIGHT(X4:X18,LEN(X4:X18)-FIND(\"/\",X4:X18)))>=B8)*(DATEVALUE(LEFT(X4:X18,FIND(\"/\",X4:X18)-1))<=B8),MATCH(ROW($W$4:$W$18),ROW($W$4:$W$18)),\"\")))","v":"2021-04-15"},null,null,null,null,null,null,null,null,null,null,null,null,null,null,{"$f":"VLOOKUP(A8,Descriptions!A1:B160,2)","v":{"$error":"#N/A"}},null,null,"2022-04-15","2022-07-01/2022-09-30"]
{"$rows_left_out":13}
{"sheet":"Printer Friendly","index":2,"n_rows":20,"n_cols":24,"rows_kept":20,"cut":false,"hidden":true,"merged":[[1,4,1,7]]}
["Subject","*** Event Start Date ***","Event Start Day","Prof. or reg. Event","Event Start Time","Event End Time","Event End Date","Second date/ times of class","Location","Registration Required","RSVP Required","Fee","Contact Hours (CEU)","No Promo needed","Zoom/Social Media Link/Teleconference #","Who - Class Instructor","Additional Presenter – \nAdd to Promo material","Calendar Name","Notes","Description"]
["Drop-down List","Input first","Auto- fill","Drop-down","Input",null,null,null,"Drop-down List","x ","x","x","#","x","Input","Drop-down List","Input","Drop-down List","Input","Auto- fill"]
["EXAMPLE",{"$f":"TODAY()+120","v":"2023-07-25"},{"$f":"WEEKDAY(B3)","v":"1900-01-03"},"Prof","12:00:00","13:00:00",null,null,"Statewide – Zoom","x ",null,"x",1,null,"Zoom link goes here","Amber Smith",null,"Statewide – Zoom",null,null,null,null,"Due Date","Date Range"]
[null,null,"1900-01-07",null,null,null,null,null,null,null,null,null,null,null,null,null,null,null,null,null,null,null,"2021-04-15","2021-07-01/2021-09-30"]
[null,null,"1900-01-07",null,null,null,null,null,null,null,null,null,null,null,null,null,null,null,null,{"$f":"VLOOKUP(A5,Descriptions!A2:B152,2)","v":{"$error":"#N/A"}},null,null,"2021-07-15","2021-10-01/2021-12-31"]
[null,null,null,null,null,null,null,null,null,null,null,null,null,null,null,null,null,null,null,{"$f":"VLOOKUP(A6,Descriptions!A3:B153,2)","v":{"$error":"#N/A"}},null,null,"2021-10-15","2022-01-01/2022-03-31"]
[null,null,{"$f":"WEEKDAY(B7)","v":"1900-01-07"},null,null,null,null,null,null,null,null,null,null,null,null,null,null,null,null,{"$f":"VLOOKUP(A7,Descriptions!A4:B154,2)","v":{"$error":"#N/A"}},null,null,"2022-01-15","2022-04-01/2022-06-30"]
[null,null,"1900-01-07",null,null,null,null,null,null,null,null,null,null,null,null,null,null,null,null,{"$f":"VLOOKUP(A8,Descriptions!A6:B155,2)","v":{"$error":"#N/A"}},null,null,"2022-04-15","2022-07-01/2022-09-30"]
{"$rows_left_out":13}
{"sheet":"Descriptions","index":3,"n_rows":150,"n_cols":9,"rows_kept":150,"cut":false,"hidden":true,"merged":[]}
["Title","Description","Location","Who","Rrule","Calendar Name","Prof or Reg",null,"Holidays"]
["\"Normal\" Aging vs \"Not Normal\" Aging","This Positive Approach™ to Care workshop helps care partners understand and recognize the differences in \"normal\" and \"not normal\" aging. Learn the value of matching helping behaviors to the person's needs and retained abilities to promote a sense of control and self-direction, and addresses typical issues that occur throughout the progression of dementia.","Statewide – Zoom","Amber Smith",null,"Statewide – Zoom","Prof",null,"2020-05-25"]
["20 Questions, 100 Answers, 6 Perspectives","Join us for a screening and discussion of  “20 Questions, 100 Answers, 6 Perspectives About Dementia,” a compilation of honest answers about dementia from medical doctors, professional care partners, and those personally affected by the disease. You will learn to understand and deal with dementia on your own terms.","ARA Anchorage Office","Debbie Chulick",null,"Anchorage Events","Reg",null,"2020-07-03"]
["Accepting the Challenge","Join us for Teepa Snow's show \"Accepting the Challenge: Providing the Best Care for People with Dementia\" and better understand the behaviors and symptoms of people with dementia while building or improving your caregiving skills. The focus of the show is on teaching state-of-the-art quality care that provides the highest quality of life for long-term care. There will be a discussion afterwards.","ARA Fairbanks Office","Gay Wellman",null,"Fairbanks Events",null,null,"2020-07-07"]
["Activity Box Ideas","People with dementia greatly benefit from activities in which they feel productive and engaged. Being engaged in a successful activity reduces agitation, anxiety and boredom. Activity boxes have many benefits such as preserving fine motor skills, providing feelings of self-worth, and satisfying sensory needs. In this class you will learn how to create fun and engaging activity boxes!",null,"Janice Downing"]
["Activities of Daily Living","Bathing, dressing, eating, using the bathroom; these basic daily activities can drastically change for our loved ones when dementia is present. Learn helpful tips and tools on making these activities easier for caregivers and more pleasant for our loved ones. All are welcome, even if you did not attend part 1 or 2 of this 3-part series.","ARA Juneau Office","Johnathan Davin",null,"Juneau Events",null,null,"2020-11-26"]
["Alaska Mental Health Trust Authority","Learn what the Mental Health Trust does, why it exists, what it means to be a beneficiary and how the Mental Health Trust supports Alaskans with Alzheimer’s Disease and Related Dementias and their caregivers.","ARA Mat-Su Office","Kim Jung",null,"Professional Webinar"]
["Alaska Legal Services Presentation","Join us and Alaska Legal Services as we explore some of the legal issues faced by those who are caring for someone with dementia. Some of the questions to be covered include: \n- When to get a lawyer and what kind of lawyer is best?\n- What is the difference between power of attorney and guardianship and when is it important to consider either?\n- What do you need to deal with end-of-life questions\n- What should you do if abuse is suspected?\n- How should you handle property and financial concerns?","Teleconference ","Laura Busby",null,"Wasilla Events",null,null,"2020-11-27"]
{"$rows_left_out":143}
{"sheet":"FY21 Q2","index":4,"n_rows":29,"n_cols":22,"rows_kept":29,"cut":false,"hidden":true,"merged":[[0,0,0,21],[1,5,1,7],[1,8,1,11]]}
["Assume each class will be posted on Social Media, have one e-blast, be placed on our online calendar and the quarterly Printable List on our website. If you want an extra e-blast, to pay for advertisement (need permission), a PSA or others, please put that in \"notes\""]
["Drop-down List","Input first","Auto- fill","Drop-down","Auto- fill","Auto- fill",null,null,"Input",null,null,null,"Drop-down List","Click on what you need","Input","Drop-down List","Input","Drop-down List","Input","Auto- fill","Click","Click"]
["Subject","******* Event Start Date","Event Start Day","Prof. or reg. Event","Promo Request  Due to Marc","Flyer Draft Due from Marc","First changes back to Marc by","Flyer Sent and posted to calendars by","Event Start Time","Event End Time","Event End Date","Second date/ times of class","Location","Reg, RSVP, Fee, Contact Hours","Zoom/Social Media Link/Teleconference #","Who","Additional Presenter","Calendar Name","Notes","Description","Director Flyer Final Sign off","Director e-mail Final Sign Off"]
[null,null,{"$f":"WEEKDAY(B4)","v":"1900-01-07"},null,{"$f":"F4-21","v":{"$error":"#VALUE!"}},{"$f":"WORKDAY(G4,-2)","v":{"$error":"#VALUE!"}},{"$f":"WORKDAY(H4,-4)","v":{"$error":"#VALUE!"}},{"$f":"IF(D4=\"Prof\",B4-42,IF(D4=\"reg\",B4-21,\"\"))","v":""},null,null,null,null,null,"Must Register\nMust RSVP\nFee\n    Contact Hrs.",null,null,null,null,null,{"$f":"VLOOKUP(A4,Descriptions!A2:B152,2)","v":{"$error":"#N/A"}},"     Francy\n     Kay","     Francy\n     Kay"]
[null,null,{"$f":"WEEKDAY(B5)","v":"1900-01-07"},null,{"$error":"#VALUE!"},{"$error":"#VALUE!"},{"$f":"WORKDAY.INTL(H5,-4)","v":{"$error":"#VALUE!"}},{"$f":"IF(D5=\"Prof\",B5-42,IF(D5=\"reg\",B5-21,\"\"))","v":""},null,null,null,null,null,"Must Register\nMust RSVP\nFee\n    Contact Hrs.",null,null,null,null,null,{"$f":"VLOOKUP(A5,Descriptions!A4:B154,2)","v":{"$error":"#N/A"}},"     Francy\n     Kay","     Francy\n     Kay"]
[null,null,"1900-01-07",null,{"$error":"#VALUE!"},{"$error":"#VALUE!"},{"$f":"WORKDAY.INTL(H6,-4)","v":{"$error":"#VALUE!"}},{"$f":"IF(D6=\"Prof\",B6-42,IF(D6=\"reg\",B6-21,\"\"))","v":""},null,null,null,null,null,"Must Register\nMust RSVP\nFee\n    Contact Hrs.",null,null,null,null,null,{"$f":"VLOOKUP(A6,Descriptions!A6:B155,2)","v":{"$error":"#N/A"}},"     Francy\n     Kay","     Francy\n     Kay"]
[null,null,"1900-01-07",null,{"$error":"#VALUE!"},{"$error":"#VALUE!"},{"$f":"WORKDAY.INTL(H7,-4)","v":{"$error":"#VALUE!"}},{"$f":"IF(D7=\"Prof\",B7-42,IF(D7=\"reg\",B7-21,\"\"))","v":""},null,null,null,null,null,"Must Register\nMust RSVP\nFee\n    Contact Hrs.",null,null,null,null,null,{"$f":"VLOOKUP(A7,Descriptions!A8:B156,2)","v":{"$error":"#N/A"}},"     Francy\n     Kay","     Francy\n     Kay"]
[null,null,"1900-01-07",null,{"$error":"#VALUE!"},{"$error":"#VALUE!"},{"$f":"WORKDAY.INTL(H8,-4)","v":{"$error":"#VALUE!"}},{"$f":"IF(D8=\"Prof\",B8-42,IF(D8=\"reg\",B8-21,\"\"))","v":""},null,null,null,null,null,"Must Register\nMust RSVP\nFee\n    Contact Hrs.",null,null,null,null,null,{"$f":"VLOOKUP(A8,Descriptions!A9:B157,2)","v":{"$error":"#N/A"}},"     Francy\n     Kay","     Francy\n     Kay"]
{"$rows_left_out":22}
{"sheet":"FY21 Q3","index":5,"n_rows":29,"n_cols":22,"rows_kept":29,"cut":false,"hidden":true,"merged":[[0,0,0,21],[1,5,1,7],[1,8,1,11]]}
["Assume each class will be posted on Social Media, have one e-blast, be placed on our online calendar and the quarterly Printable List on our website. If you want an extra e-blast, to pay for advertisement (need permission), a PSA or others, please put that in \"notes\""]
["Drop-down List","Input first","Auto- fill","Drop-down","Auto- fill","Auto- fill",null,null,"Input",null,null,null,"Drop-down List","Click on what you need","Input","Drop-down List","Input","Drop-down List","Input","Auto- fill","Click","Click"]
["Subject","******* Event Start Date","Event Start Day","Prof. or reg. Event","Promo Request  Due to Marc","Flyer Draft Due from Marc","First changes back to Marc by","Flyer Sent and posted to calendars by","Event Start Time","Event End Time","Event End Date","Second date/ times of class","Location","Reg, RSVP, Fee, Contact Hours","Zoom/Social Media Link/Teleconference #","Who","Additional Presenter","Calendar Name","Notes","Description","Director Flyer Final Sign off","Director e-mail Final Sign Off"]
[null,null,{"$f":"WEEKDAY(B4)","v":"1900-01-07"},null,{"$f":"F4-21","v":{"$error":"#VALUE!"}},{"$f":"WORKDAY(G4,-2)","v":{"$error":"#VALUE!"}},{"$f":"WORKDAY(H4,-4)","v":{"$error":"#VALUE!"}},{"$f":"IF(D4=\"Prof\",B4-42,IF(D4=\"reg\",B4-21,\"\"))","v":""},null,null,null,null,null,"Must Register\nMust RSVP\nFee\n    Contact Hrs.",null,null,null,null,null,{"$f":"VLOOKUP(A4,Descriptions!A2:B152,2)","v":{"$error":"#N/A"}},"     Francy\n     Kay","     Francy\n     Kay"]
[null,null,{"$f":"WEEKDAY(B5)","v":"1900-01-07"},null,{"$error":"#VALUE!"},{"$error":"#VALUE!"},{"$f":"WORKDAY.INTL(H5,-4)","v":{"$error":"#VALUE!"}},{"$f":"IF(D5=\"Prof\",B5-42,IF(D5=\"reg\",B5-21,\"\"))","v":""},null,null,null,null,null,"Must Register\nMust RSVP\nFee\n    Contact Hrs.",null,null,null,null,null,{"$f":"VLOOKUP(A5,Descriptions!A4:B154,2)","v":{"$error":"#N/A"}},"     Francy\n     Kay","     Francy\n     Kay"]
[null,null,"1900-01-07",null,{"$error":"#VALUE!"},{"$error":"#VALUE!"},{"$f":"WORKDAY.INTL(H6,-4)","v":{"$error":"#VALUE!"}},{"$f":"IF(D6=\"Prof\",B6-42,IF(D6=\"reg\",B6-21,\"\"))","v":""},null,null,null,null,null,"Must Register\nMust RSVP\nFee\n    Contact Hrs.",null,null,null,null,null,{"$f":"VLOOKUP(A6,Descriptions!A6:B155,2)","v":{"$error":"#N/A"}},"     Francy\n     Kay","     Francy\n     Kay"]
[null,null,"1900-01-07",null,{"$error":"#VALUE!"},{"$error":"#VALUE!"},{"$f":"WORKDAY.INTL(H7,-4)","v":{"$error":"#VALUE!"}},{"$f":"IF(D7=\"Prof\",B7-42,IF(D7=\"reg\",B7-21,\"\"))","v":""},null,null,null,null,null,"Must Register\nMust RSVP\nFee\n    Contact Hrs.",null,null,null,null,null,{"$f":"VLOOKUP(A7,Descriptions!A8:B156,2)","v":{"$error":"#N/A"}},"     Francy\n     Kay","     Francy\n     Kay"]
[null,null,"1900-01-07",null,{"$error":"#VALUE!"},{"$error":"#VALUE!"},{"$f":"WORKDAY.INTL(H8,-4)","v":{"$error":"#VALUE!"}},{"$f":"IF(D8=\"Prof\",B8-42,IF(D8=\"reg\",B8-21,\"\"))","v":""},null,null,null,null,null,"Must Register\nMust RSVP\nFee\n    Contact Hrs.",null,null,null,null,null,{"$f":"VLOOKUP(A8,Descriptions!A9:B157,2)","v":{"$error":"#N/A"}},"     Francy\n     Kay","     Francy\n     Kay"]
{"$rows_left_out":22}
{"sheet":"FY21 Q4","index":6,"n_rows":29,"n_cols":22,"rows_kept":29,"cut":false,"hidden":true,"merged":[[0,0,0,21],[1,5,1,7],[1,8,1,11]]}
["Assume each class will be posted on Social Media, have one e-blast, be placed on our online calendar and the quarterly Printable List on our website. If you want an extra e-blast, to pay for advertisement (need permission), a PSA or others, please put that in \"notes\""]
["Drop-down List","Input first","Auto- fill","Drop-down","Auto- fill","Auto- fill",null,null,"Input",null,null,null,"Drop-down List","Click on what you need","Input","Drop-down List","Input","Drop-down List","Input","Auto- fill","Click","Click"]
["Subject","******* Event Start Date","Event Start Day","Prof. or reg. Event","Promo Request  Due to Marc","Flyer Draft Due from Marc","First changes back to Marc by","Flyer Sent and posted to calendars by","Event Start Time","Event End Time","Event End Date","Second date/ times of class","Location","Reg, RSVP, Fee, Contact Hours","Zoom/Social Media Link/Teleconference #","Who","Additional Presenter","Calendar Name","Notes","Description","Director Flyer Final Sign off","Director e-mail Final Sign Off"]
[null,null,{"$f":"WEEKDAY(B4)","v":"1900-01-07"},null,{"$f":"F4-21","v":{"$error":"#VALUE!"}},{"$f":"WORKDAY(G4,-2)","v":{"$error":"#VALUE!"}},{"$f":"WORKDAY(H4,-4)","v":{"$error":"#VALUE!"}},{"$f":"IF(D4=\"Prof\",B4-42,IF(D4=\"reg\",B4-21,\"\"))","v":""},null,null,null,null,null,"Must Register\nMust RSVP\nFee\n    Contact Hrs.",null,null,null,null,null,{"$f":"VLOOKUP(A4,Descriptions!A2:B152,2)","v":{"$error":"#N/A"}},"     Francy\n     Kay","     Francy\n     Kay"]
[null,null,{"$f":"WEEKDAY(B5)","v":"1900-01-07"},null,{"$error":"#VALUE!"},{"$error":"#VALUE!"},{"$f":"WORKDAY.INTL(H5,-4)","v":{"$error":"#VALUE!"}},{"$f":"IF(D5=\"Prof\",B5-42,IF(D5=\"reg\",B5-21,\"\"))","v":""},null,null,null,null,null,"Must Register\nMust RSVP\nFee\n    Contact Hrs.",null,null,null,null,null,{"$f":"VLOOKUP(A5,Descriptions!A4:B154,2)","v":{"$error":"#N/A"}},"     Francy\n     Kay","     Francy\n     Kay"]
[null,null,"1900-01-07",null,{"$error":"#VALUE!"},{"$error":"#VALUE!"},{"$f":"WORKDAY.INTL(H6,-4)","v":{"$error":"#VALUE!"}},{"$f":"IF(D6=\"Prof\",B6-42,IF(D6=\"reg\",B6-21,\"\"))","v":""},null,null,null,null,null,"Must Register\nMust RSVP\nFee\n    Contact Hrs.",null,null,null,null,null,{"$f":"VLOOKUP(A6,Descriptions!A6:B155,2)","v":{"$error":"#N/A"}},"     Francy\n     Kay","     Francy\n     Kay"]
[null,null,"1900-01-07",null,{"$error":"#VALUE!"},{"$error":"#VALUE!"},{"$f":"WORKDAY.INTL(H7,-4)","v":{"$error":"#VALUE!"}},{"$f":"IF(D7=\"Prof\",B7-42,IF(D7=\"reg\",B7-21,\"\"))","v":""},null,null,null,null,null,"Must Register\nMust RSVP\nFee\n    Contact Hrs.",null,null,null,null,null,{"$f":"VLOOKUP(A7,Descriptions!A8:B156,2)","v":{"$error":"#N/A"}},"     Francy\n     Kay","     Francy\n     Kay"]
[null,null,"1900-01-07",null,{"$error":"#VALUE!"},{"$error":"#VALUE!"},{"$f":"WORKDAY.INTL(H8,-4)","v":{"$error":"#VALUE!"}},{"$f":"IF(D8=\"Prof\",B8-42,IF(D8=\"reg\",B8-21,\"\"))","v":""},null,null,null,null,null,"Must Register\nMust RSVP\nFee\n    Contact Hrs.",null,null,null,null,null,{"$f":"VLOOKUP(A8,Descriptions!A9:B157,2)","v":{"$error":"#N/A"}},"     Francy\n     Kay","     Francy\n     Kay"]
{"$rows_left_out":21}